Information card for entry 7247474
Chemical name | 3-benzoylpropionic acid |
Formula | C10 H10 O3 |
Calculated formula | C10 H10 O3 |
Title of publication | Melting pseudosymmetry and thermal expansion in 3-benzoylpropionic acid |
Authors of publication | Poręba, Tomasz; Świątkowski, Marcin; Confalonieri, Giorgia |
Journal of publication | CrystEngComm |
Year of publication | 2023 |
Journal volume | 25 |
Journal issue | 42 |
Pages of publication | 5932 - 5941 |
a | 15.3811 ± 0.0003 Å |
b | 5.21845 ± 0.00012 Å |
c | 22.4123 ± 0.0005 Å |
α | 90° |
β | 97.767 ± 0.002° |
γ | 90° |
Cell volume | 1782.43 ± 0.07 Å3 |
Cell temperature | 210 ± 0.1 K |
Ambient diffraction temperature | 210 ± 0.1 K |
Number of distinct elements | 3 |
Space group number | 14 |
Hermann-Mauguin space group symbol | P 1 21/c 1 |
Hall space group symbol | -P 2ybc |
Residual factor for all reflections | 0.0518 |
Residual factor for significantly intense reflections | 0.0429 |
Weighted residual factors for significantly intense reflections | 0.1207 |
Weighted residual factors for all reflections included in the refinement | 0.1272 |
Goodness-of-fit parameter for all reflections included in the refinement | 1.049 |
Diffraction radiation probe | x-ray |
Diffraction radiation wavelength | 1.54184 Å |
Diffraction radiation type | CuKα |