Information card for entry 7247477
Common name | 3-benzoylpropionic acid |
Chemical name | 3-benzoylpropionic acid |
Formula | C10 H10 O3 |
Calculated formula | C10 H10 O3 |
Title of publication | Melting pseudosymmetry and thermal expansion in 3-benzoylpropionic acid |
Authors of publication | Poręba, Tomasz; Świątkowski, Marcin; Confalonieri, Giorgia |
Journal of publication | CrystEngComm |
Year of publication | 2023 |
Journal volume | 25 |
Journal issue | 42 |
Pages of publication | 5932 - 5941 |
a | 15.4043 ± 0.0004 Å |
b | 5.2267 ± 0.0001 Å |
c | 22.4631 ± 0.0006 Å |
α | 90° |
β | 97.697 ± 0.003° |
γ | 90° |
Cell volume | 1792.29 ± 0.08 Å3 |
Cell temperature | 235 ± 0.1 K |
Ambient diffraction temperature | 235 ± 0.1 K |
Number of distinct elements | 3 |
Space group number | 14 |
Hermann-Mauguin space group symbol | P 1 21/c 1 |
Hall space group symbol | -P 2ybc |
Residual factor for all reflections | 0.0696 |
Residual factor for significantly intense reflections | 0.0493 |
Weighted residual factors for significantly intense reflections | 0.1505 |
Weighted residual factors for all reflections included in the refinement | 0.165 |
Goodness-of-fit parameter for all reflections included in the refinement | 1.071 |
Diffraction radiation probe | x-ray |
Diffraction radiation wavelength | 1.54184 Å |
Diffraction radiation type | CuKα |