Information card for entry 7247538
Chemical name | N,N'-Bis(5-phenyl-5-dibenzo[a,d]cycloheptenyl)ethylenediamine |
Formula | C56 H50 N4 |
Calculated formula | C56 H50 N4 |
Title of publication | The behaviour of tricyclic fused host systems comprising seven-membered B-rings in mixed pyridines |
Authors of publication | Barton, Benita; Caira, Mino R.; Trollip, Danica B.; Hosten, Eric C. |
Journal of publication | CrystEngComm |
Year of publication | 2023 |
Journal volume | 25 |
Journal issue | 45 |
Pages of publication | 6317 - 6328 |
a | 8.7173 ± 0.0006 Å |
b | 11.2718 ± 0.0008 Å |
c | 12.6826 ± 0.0009 Å |
α | 108.163 ± 0.003° |
β | 105.764 ± 0.002° |
γ | 104.337 ± 0.002° |
Cell volume | 1061.65 ± 0.13 Å3 |
Cell temperature | 200 ± 2 K |
Ambient diffraction temperature | 200 ± 2 K |
Number of distinct elements | 3 |
Space group number | 2 |
Hermann-Mauguin space group symbol | P -1 |
Hall space group symbol | -P 1 |
Residual factor for all reflections | 0.0474 |
Residual factor for significantly intense reflections | 0.0392 |
Weighted residual factors for significantly intense reflections | 0.102 |
Weighted residual factors for all reflections included in the refinement | 0.1095 |
Goodness-of-fit parameter for all reflections included in the refinement | 1.029 |
Diffraction radiation wavelength | 0.71073 Å |
Diffraction radiation type | MoKα |