Information card for entry 7247540
Chemical name | N,N'-Bis(5-phenyl-5-dibenzo[a,d]cycloheptenyl)ethylenediamine |
Formula | C56 H50 N4 |
Calculated formula | C56 H50 N4 |
Title of publication | The behaviour of tricyclic fused host systems comprising seven-membered B-rings in mixed pyridines |
Authors of publication | Barton, Benita; Caira, Mino R.; Trollip, Danica B.; Hosten, Eric C. |
Journal of publication | CrystEngComm |
Year of publication | 2023 |
Journal volume | 25 |
Journal issue | 45 |
Pages of publication | 6317 - 6328 |
a | 8.9471 ± 0.001 Å |
b | 9.974 ± 0.0011 Å |
c | 13.4375 ± 0.0014 Å |
α | 73.488 ± 0.004° |
β | 75.543 ± 0.004° |
γ | 74.301 ± 0.004° |
Cell volume | 1087.2 ± 0.2 Å3 |
Cell temperature | 296 ± 2 K |
Ambient diffraction temperature | 296 ± 2 K |
Number of distinct elements | 3 |
Space group number | 2 |
Hermann-Mauguin space group symbol | P -1 |
Hall space group symbol | -P 1 |
Residual factor for all reflections | 0.0715 |
Residual factor for significantly intense reflections | 0.0604 |
Weighted residual factors for significantly intense reflections | 0.1718 |
Weighted residual factors for all reflections included in the refinement | 0.1859 |
Goodness-of-fit parameter for all reflections included in the refinement | 1.049 |
Diffraction radiation wavelength | 0.71073 Å |
Diffraction radiation type | MoKα |