Information card for entry 7247555
Chemical name | 1,1-dimethyl-5-fluoro-2,1,3-benzoxasilaborol-3(1H)-ol |
Formula | C8 H10 B F O2 Si |
Calculated formula | C8 H10 B F O2 Si |
Title of publication | Exploring the effect of substitution patterns on the symmetry of hydrogen-bonded supramolecular motifs in functionalized benzosiloxaboroles |
Authors of publication | Durka, Krzysztof; Zuba, Adam; Marek-Urban, Paulina H.; Nowicki, Krzysztof; Drapała, Jakub; Woźniak, Krzysztof; Luliński, Sergiusz |
Journal of publication | CrystEngComm |
Year of publication | 2023 |
Journal volume | 25 |
Journal issue | 45 |
Pages of publication | 6329 - 6342 |
a | 8.5329 ± 0.0004 Å |
b | 17.0749 ± 0.0004 Å |
c | 13.9049 ± 0.0009 Å |
α | 90° |
β | 101.787 ± 0.007° |
γ | 90° |
Cell volume | 1983.2 ± 0.17 Å3 |
Cell temperature | 100 ± 2 K |
Ambient diffraction temperature | 100.01 ± 0.1 K |
Number of distinct elements | 6 |
Space group number | 14 |
Hermann-Mauguin space group symbol | P 1 21/n 1 |
Hall space group symbol | -P 2yn |
Residual factor for all reflections | 0.0533 |
Residual factor for significantly intense reflections | 0.0424 |
Weighted residual factors for significantly intense reflections | 0.0975 |
Weighted residual factors for all reflections included in the refinement | 0.1044 |
Goodness-of-fit parameter for all reflections included in the refinement | 1.028 |
Diffraction radiation probe | x-ray |
Diffraction radiation wavelength | 0.71073 Å |
Diffraction radiation type | MoKα |