Information card for entry 7247560
Chemical name | 1,1-dimethyl-7-(trifluoromethyl)-3-hydroxybenzo[c][1,2,3]siloxaborole |
Formula | C9 H10 B F3 O2 Si |
Calculated formula | C9 H10 B F3 O2 Si |
Title of publication | Exploring the effect of substitution patterns on the symmetry of hydrogen-bonded supramolecular motifs in functionalized benzosiloxaboroles |
Authors of publication | Durka, Krzysztof; Zuba, Adam; Marek-Urban, Paulina H.; Nowicki, Krzysztof; Drapała, Jakub; Woźniak, Krzysztof; Luliński, Sergiusz |
Journal of publication | CrystEngComm |
Year of publication | 2023 |
Journal volume | 25 |
Journal issue | 45 |
Pages of publication | 6329 - 6342 |
a | 15.8197 ± 0.0002 Å |
b | 15.8197 ± 0.0002 Å |
c | 18.3035 ± 0.0005 Å |
α | 90° |
β | 90° |
γ | 90° |
Cell volume | 4580.69 ± 0.15 Å3 |
Cell temperature | 100 ± 2 K |
Ambient diffraction temperature | 100 ± 2 K |
Number of distinct elements | 6 |
Space group number | 88 |
Hermann-Mauguin space group symbol | I 41/a :2 |
Hall space group symbol | -I 4ad |
Residual factor for all reflections | 0.0446 |
Residual factor for significantly intense reflections | 0.037 |
Weighted residual factors for significantly intense reflections | 0.09 |
Weighted residual factors for all reflections included in the refinement | 0.0953 |
Goodness-of-fit parameter for all reflections included in the refinement | 1.055 |
Diffraction radiation probe | x-ray |
Diffraction radiation wavelength | 0.71073 Å |
Diffraction radiation type | MoKα |