Information card for entry 7247568
Chemical name | MHOF-PO4-2 |
Formula | C45 H63 Cu3 N6 O16 P |
Calculated formula | C45 H63 Cu3 N6 O16 P |
Title of publication | Synthesis and characterization of two metallo-hydrogen-bonded organic frameworks with diverse structures and properties |
Authors of publication | Zhou, Mi; Wang, Yujiang; Yuan, Guoyuan; Ju, Zhanfeng; Yuan, Daqiang |
Journal of publication | CrystEngComm |
Year of publication | 2023 |
Journal volume | 25 |
Journal issue | 44 |
Pages of publication | 6132 - 6136 |
a | 19.794 ± 0.0002 Å |
b | 19.794 ± 0.0002 Å |
c | 9.0285 ± 0.0001 Å |
α | 90° |
β | 90° |
γ | 120° |
Cell volume | 3063.47 ± 0.06 Å3 |
Cell temperature | 155 ± 7 K |
Ambient diffraction temperature | 155 ± 7 K |
Number of distinct elements | 6 |
Space group number | 173 |
Hermann-Mauguin space group symbol | P 63 |
Hall space group symbol | P 6c |
Residual factor for all reflections | 0.0203 |
Residual factor for significantly intense reflections | 0.0199 |
Weighted residual factors for significantly intense reflections | 0.0536 |
Weighted residual factors for all reflections included in the refinement | 0.0541 |
Goodness-of-fit parameter for all reflections included in the refinement | 1.084 |
Diffraction radiation wavelength | 1.54184 Å |
Diffraction radiation type | CuKα |