Information card for entry 7247582
Formula | C15 H16 Cl N O4 |
Calculated formula | C15 H16 Cl N O4 |
Title of publication | New Schiff base salts as sources of blue and green light in the solid state: the role of the anion and protonation |
Authors of publication | Sobczak, Paulina; Sierański, Tomasz; Świątkowski, Marcin; Trzęsowska-Kruszyńska, Agata |
Journal of publication | CrystEngComm |
Year of publication | 2023 |
Journal volume | 25 |
Journal issue | 44 |
Pages of publication | 6185 - 6193 |
a | 4.7037 ± 0.0001 Å |
b | 20.9656 ± 0.0003 Å |
c | 14.8427 ± 0.0002 Å |
α | 90° |
β | 92.196 ± 0.001° |
γ | 90° |
Cell volume | 1462.65 ± 0.04 Å3 |
Cell temperature | 100 ± 0.13 K |
Ambient diffraction temperature | 100 ± 0.13 K |
Number of distinct elements | 5 |
Space group number | 14 |
Hermann-Mauguin space group symbol | P 1 21/c 1 |
Hall space group symbol | -P 2ybc |
Residual factor for all reflections | 0.046 |
Residual factor for significantly intense reflections | 0.0392 |
Weighted residual factors for significantly intense reflections | 0.0992 |
Weighted residual factors for all reflections included in the refinement | 0.1029 |
Goodness-of-fit parameter for all reflections included in the refinement | 1.044 |
Diffraction radiation probe | x-ray |
Diffraction radiation wavelength | 1.54184 Å |
Diffraction radiation type | CuKα |