Information card for entry 7247610
Formula | C47.6 H38.8 Cl F4 Ir N2 O7.3 P |
Calculated formula | C47.6 H38.8 Cl F4 Ir N2 O7.3 P |
Title of publication | Ligand effect of cyclometallated iridium(iii) complexes on N-alkylation of amines in hydrogen borrowing reactions |
Authors of publication | Chen, Yi-Sheng; Chiu, Siang-Yu; Li, Chia-Ying; Chen, Tsun-Ren; Chen, Jhy-Der |
Journal of publication | RSC Advances |
Year of publication | 2023 |
Journal volume | 13 |
Journal issue | 45 |
Pages of publication | 31948 - 31961 |
a | 19.1611 ± 0.0008 Å |
b | 20.4125 ± 0.0009 Å |
c | 23.7193 ± 0.001 Å |
α | 90° |
β | 90° |
γ | 90° |
Cell volume | 9277.2 ± 0.7 Å3 |
Cell temperature | 297 ± 2 K |
Ambient diffraction temperature | 297 ± 2 K |
Number of distinct elements | 8 |
Space group number | 61 |
Hermann-Mauguin space group symbol | P b c a |
Hall space group symbol | -P 2ac 2ab |
Residual factor for all reflections | 0.0535 |
Residual factor for significantly intense reflections | 0.0324 |
Weighted residual factors for significantly intense reflections | 0.1027 |
Weighted residual factors for all reflections included in the refinement | 0.1171 |
Goodness-of-fit parameter for all reflections included in the refinement | 1.047 |
Diffraction radiation probe | x-ray |
Diffraction radiation wavelength | 0.71073 Å |
Diffraction radiation type | MoKα |