Information card for entry 7247626
Formula | C21 H18 Eu N9 O12 |
Calculated formula | C21 H18 Eu N9 O12 |
SMILES | [Eu]123([O]=n4cccc5c4[nH]cc5)([O]=n4cccc5c4[nH]cc5)([O]=n4cccc5c4[nH]cc5)([O]=N(=O)O1)(ON(=[O]2)=O)ON(=[O]3)=O |
Title of publication | Supporting coordination through hydrogen bonding in lanthanide complexes of 7-azaindole-N-oxide |
Authors of publication | Wood, Oskar G.; Jones, Leanne; Hawes, Chris S. |
Journal of publication | CrystEngComm |
Year of publication | 2023 |
Journal volume | 25 |
Journal issue | 45 |
Pages of publication | 6371 - 6378 |
a | 8.5699 ± 0.0004 Å |
b | 11.7452 ± 0.0006 Å |
c | 14.2218 ± 0.0007 Å |
α | 78.654 ± 0.001° |
β | 77.154 ± 0.001° |
γ | 70.806 ± 0.001° |
Cell volume | 1306.15 ± 0.11 Å3 |
Cell temperature | 150 K |
Ambient diffraction temperature | 150 K |
Number of distinct elements | 5 |
Space group number | 2 |
Hermann-Mauguin space group symbol | P -1 |
Hall space group symbol | -P 1 |
Residual factor for all reflections | 0.0169 |
Residual factor for significantly intense reflections | 0.0159 |
Weighted residual factors for significantly intense reflections | 0.0378 |
Weighted residual factors for all reflections included in the refinement | 0.0381 |
Goodness-of-fit parameter for all reflections included in the refinement | 1.169 |
Diffraction radiation wavelength | 0.71073 Å |
Diffraction radiation type | MoKα |