Information card for entry 7247629
Formula | C8 H8 Br3 N Pb S |
Calculated formula | C8 H8 Br3 N Pb S |
Title of publication | Regulating the crystal and electronic structures and optical properties of hybrid bromoplumbates with alkylated N, S- or P-containing aromatic cations |
Authors of publication | Gao, Cheng-Cheng; Tang, Xue-Na; Miao, Jing-Ling; Li, Yu; Li, Cuncheng; Liu, Guang-Ning |
Journal of publication | CrystEngComm |
Year of publication | 2023 |
Journal volume | 25 |
Journal issue | 47 |
Pages of publication | 6556 - 6567 |
a | 7.7383 ± 0.0004 Å |
b | 11.5787 ± 0.0007 Å |
c | 14.7269 ± 0.0012 Å |
α | 90° |
β | 90° |
γ | 90° |
Cell volume | 1319.52 ± 0.15 Å3 |
Cell temperature | 293 ± 2 K |
Ambient diffraction temperature | 293 ± 2 K |
Number of distinct elements | 6 |
Space group number | 19 |
Hermann-Mauguin space group symbol | P 21 21 21 |
Hall space group symbol | P 2ac 2ab |
Residual factor for all reflections | 0.0852 |
Residual factor for significantly intense reflections | 0.0491 |
Weighted residual factors for significantly intense reflections | 0.1027 |
Weighted residual factors for all reflections included in the refinement | 0.1111 |
Goodness-of-fit parameter for all reflections included in the refinement | 0.916 |
Diffraction radiation probe | x-ray |
Diffraction radiation wavelength | 0.71073 Å |
Diffraction radiation type | MoKα |