Information card for entry 7247636
Formula | C14 H8 N4 S2 |
Calculated formula | C14 H8 N4 S2 |
Title of publication | The physical and electronic properties of Metal–Organic Frameworks containing dipyridylthiazolo[5,4-d]thiazole |
Authors of publication | Rizzuto, Felix J.; Pal, Shyam C.; Kearns, Eleanor R.; Hua, Carol; Solomon, Marcello B.; Doheny, Patrick W.; Faust, Thomas B.; Kepert, Cameron J.; Das, Madhab C.; D'Alessandro, Deanna M. |
Journal of publication | CrystEngComm |
Year of publication | 2023 |
Journal volume | 25 |
Journal issue | 46 |
Pages of publication | 6434 - 6440 |
a | 8.4275 ± 0.0006 Å |
b | 6.304 ± 0.0004 Å |
c | 11.748 ± 0.0007 Å |
α | 90° |
β | 93.544 ± 0.006° |
γ | 90° |
Cell volume | 622.94 ± 0.07 Å3 |
Cell temperature | 150.15 K |
Ambient diffraction temperature | 150.15 K |
Number of distinct elements | 4 |
Space group number | 14 |
Hermann-Mauguin space group symbol | P 1 21/c 1 |
Hall space group symbol | -P 2ybc |
Residual factor for all reflections | 0.0531 |
Residual factor for significantly intense reflections | 0.0418 |
Weighted residual factors for significantly intense reflections | 0.1004 |
Weighted residual factors for all reflections included in the refinement | 0.1072 |
Goodness-of-fit parameter for all reflections included in the refinement | 1.077 |
Diffraction radiation wavelength | 0.71073 Å |
Diffraction radiation type | MoKα |