Information card for entry 7247650
Formula | C23 H36 F6 N4 Ni O6 |
Calculated formula | C23 H36 F6 N4 Ni O6 |
Title of publication | Alternating [ML2(MeOH)2] and [ML2(EtOH)2] layers in low-temperature ferromagnets [ML2(MeOH)2][ML2(EtOH)2] (M = CoII, NiII or CoII0.5NiII0.5) |
Authors of publication | Ovcharenko, Victor; Fursova, Elena; Letyagin, Gleb; Morozov, Vitaly; Bogomyakov, Artem; Romanenko, Galina |
Journal of publication | CrystEngComm |
Year of publication | 2023 |
Journal volume | 25 |
Journal issue | 44 |
Pages of publication | 6194 - 6203 |
a | 18.564 ± 0.004 Å |
b | 15.699 ± 0.003 Å |
c | 11.768 ± 0.002 Å |
α | 90° |
β | 120.67 ± 0.03° |
γ | 90° |
Cell volume | 2949.9 ± 1.3 Å3 |
Cell temperature | 293 ± 2 K |
Ambient diffraction temperature | 293 ± 2 K |
Number of distinct elements | 6 |
Space group number | 14 |
Hermann-Mauguin space group symbol | P 1 21/c 1 |
Hall space group symbol | -P 2ybc |
Residual factor for all reflections | 0.1172 |
Residual factor for significantly intense reflections | 0.0441 |
Weighted residual factors for significantly intense reflections | 0.1031 |
Weighted residual factors for all reflections included in the refinement | 0.1341 |
Goodness-of-fit parameter for all reflections included in the refinement | 0.872 |
Diffraction radiation wavelength | 0.71073 Å |
Diffraction radiation type | MoKα |