Information card for entry 7247685
Formula | C8 H20 Cl4 Mn N2 O4 |
Calculated formula | C8 H20 Cl4 Mn N2 O4 |
Title of publication | The odd–even effect in n-carboxyalkylammonium-containing organic–inorganic hybrids of Mn(ii) halides: structural and magnetic characterisation |
Authors of publication | Bothma, Shalene N.; Sheppard, Charles J.; Turnbull, Mark M.; Landee, Christopher P.; Rademeyer, Melanie |
Journal of publication | CrystEngComm |
Year of publication | 2023 |
Journal volume | 25 |
Journal issue | 47 |
Pages of publication | 6568 - 6591 |
a | 16.1956 ± 0.0004 Å |
b | 7.178 ± 0.0002 Å |
c | 7.2126 ± 0.0002 Å |
α | 90° |
β | 100.097 ± 0.002° |
γ | 90° |
Cell volume | 825.49 ± 0.04 Å3 |
Cell temperature | 150 ± 2 K |
Ambient diffraction temperature | 150 ± 2 K |
Number of distinct elements | 6 |
Space group number | 14 |
Hermann-Mauguin space group symbol | P 1 21/c 1 |
Hall space group symbol | -P 2ybc |
Residual factor for all reflections | 0.022 |
Residual factor for significantly intense reflections | 0.0199 |
Weighted residual factors for significantly intense reflections | 0.0502 |
Weighted residual factors for all reflections included in the refinement | 0.0512 |
Goodness-of-fit parameter for all reflections included in the refinement | 1.129 |
Diffraction radiation wavelength | 0.71073 Å |
Diffraction radiation type | MoKα |