Information card for entry 7247688
Formula | C12 H28 Cl4 Mn N2 O4 |
Calculated formula | C12 H28 Cl4 Mn N2 O4 |
Title of publication | The odd–even effect in n-carboxyalkylammonium-containing organic–inorganic hybrids of Mn(ii) halides: structural and magnetic characterisation |
Authors of publication | Bothma, Shalene N.; Sheppard, Charles J.; Turnbull, Mark M.; Landee, Christopher P.; Rademeyer, Melanie |
Journal of publication | CrystEngComm |
Year of publication | 2023 |
Journal volume | 25 |
Journal issue | 47 |
Pages of publication | 6568 - 6591 |
a | 7.137 ± 0.0001 Å |
b | 7.2664 ± 0.0001 Å |
c | 19.6318 ± 0.0004 Å |
α | 85.695 ± 0.002° |
β | 87.366 ± 0.002° |
γ | 88.66 ± 0.002° |
Cell volume | 1013.96 ± 0.03 Å3 |
Cell temperature | 150 ± 2 K |
Ambient diffraction temperature | 150 ± 2 K |
Number of distinct elements | 6 |
Space group number | 2 |
Hermann-Mauguin space group symbol | P -1 |
Hall space group symbol | -P 1 |
Residual factor for all reflections | 0.0288 |
Residual factor for significantly intense reflections | 0.0256 |
Weighted residual factors for significantly intense reflections | 0.0616 |
Weighted residual factors for all reflections included in the refinement | 0.0626 |
Goodness-of-fit parameter for all reflections included in the refinement | 1.11 |
Diffraction radiation wavelength | 0.71073 Å |
Diffraction radiation type | MoKα |