Information card for entry 7247709
Common name | Tioconazole Hydrobromide Salt |
Formula | C16 H14 Br Cl3 N2 O S |
Calculated formula | C16 H14 Br Cl3 N2 O S |
Title of publication | Development of new multicomponent crystals of the antifungal drug tioconazole and the assessment of their biopharmaceutical attributes |
Authors of publication | Madhesiya, Avinash; Dash, Sibananda G.; Gupta, Princi; Akhir, Abdul; Saxena, Deepanshi; Maitra, Rahul; Chopra, Sidharth; Thakur, Tejender S. |
Journal of publication | CrystEngComm |
Year of publication | 2023 |
Journal volume | 25 |
Journal issue | 48 |
Pages of publication | 6758 - 6776 |
a | 35.975 ± 0.0019 Å |
b | 6.3852 ± 0.0004 Å |
c | 17.1343 ± 0.0009 Å |
α | 90° |
β | 104.246 ± 0.003° |
γ | 90° |
Cell volume | 3814.8 ± 0.4 Å3 |
Cell temperature | 296 ± 2 K |
Ambient diffraction temperature | 296 ± 2 K |
Number of distinct elements | 7 |
Space group number | 15 |
Hermann-Mauguin space group symbol | C 1 2/c 1 |
Hall space group symbol | -C 2yc |
Residual factor for all reflections | 0.0675 |
Residual factor for significantly intense reflections | 0.0478 |
Weighted residual factors for significantly intense reflections | 0.1178 |
Weighted residual factors for all reflections included in the refinement | 0.1306 |
Goodness-of-fit parameter for all reflections included in the refinement | 1.04 |
Diffraction radiation wavelength | 1.54178 Å |
Diffraction radiation type | CuKα |