Information card for entry 7247722
Common name | Tioconazole-Fumerate salt monohydrate |
Formula | C20 H17 Cl3 N2 O6 S |
Calculated formula | C20 H17 Cl3 N2 O6 S |
Title of publication | Development of new multicomponent crystals of the antifungal drug tioconazole and the assessment of their biopharmaceutical attributes |
Authors of publication | Madhesiya, Avinash; Dash, Sibananda G.; Gupta, Princi; Akhir, Abdul; Saxena, Deepanshi; Maitra, Rahul; Chopra, Sidharth; Thakur, Tejender S. |
Journal of publication | CrystEngComm |
Year of publication | 2023 |
Journal volume | 25 |
Journal issue | 48 |
Pages of publication | 6758 - 6776 |
a | 7.4874 ± 0.0002 Å |
b | 8.0833 ± 0.0003 Å |
c | 19.8791 ± 0.0005 Å |
α | 94.572 ± 0.002° |
β | 98.318 ± 0.002° |
γ | 94.709 ± 0.003° |
Cell volume | 1181.34 ± 0.06 Å3 |
Cell temperature | 293 ± 2 K |
Ambient diffraction temperature | 293 ± 2 K |
Number of distinct elements | 6 |
Space group number | 2 |
Hermann-Mauguin space group symbol | P -1 |
Hall space group symbol | -P 1 |
Residual factor for all reflections | 0.0836 |
Residual factor for significantly intense reflections | 0.0726 |
Weighted residual factors for significantly intense reflections | 0.1881 |
Weighted residual factors for all reflections included in the refinement | 0.2029 |
Goodness-of-fit parameter for all reflections included in the refinement | 1.047 |
Diffraction radiation wavelength | 1.54184 Å |
Diffraction radiation type | CuKα |