Information card for entry 7247762
Common name | ZIF-67 |
Formula | C8.34 H11 Co N9.17 O0.17 |
Calculated formula | C8 H10 Co N9.16667 |
Title of publication | High-pressure induced guest-mediated gate opening behaviour of the Co-based framework ZIF-67 |
Authors of publication | Jones, Isabelle M.; Turner, Gemma F.; Pitts, Kari; Powell, Rees; Riboldi-Tunnicliffe, Alan; Williamson, Rachel; Boer, Stephanie; Allen, Lauren; Moggach, Stephen A. |
Journal of publication | CrystEngComm |
Year of publication | 2023 |
Journal volume | 25 |
Journal issue | 47 |
Pages of publication | 6533 - 6538 |
a | 17.1155 ± 0.0007 Å |
b | 17.1155 ± 0.0007 Å |
c | 17.1155 ± 0.0007 Å |
α | 90° |
β | 90° |
γ | 90° |
Cell volume | 5013.8 ± 0.4 Å3 |
Cell temperature | 293 K |
Ambient diffraction temperature | 293 K |
Number of distinct elements | 5 |
Space group number | 217 |
Hermann-Mauguin space group symbol | I -4 3 m |
Hall space group symbol | I -4 2 3 |
Residual factor for all reflections | 0.0696 |
Residual factor for significantly intense reflections | 0.066 |
Weighted residual factors for significantly intense reflections | 0.1848 |
Weighted residual factors for all reflections included in the refinement | 0.1875 |
Goodness-of-fit parameter for all reflections included in the refinement | 1.189 |
Diffraction radiation probe | x-ray |
Diffraction radiation wavelength | 0.71073 Å |
Diffraction radiation type | MoKα |