Information card for entry 7247765
Common name | ZIF-67 |
Formula | C8 H10 Co N13.73 |
Calculated formula | C8 H10 Co N13.7334 |
Title of publication | High-pressure induced guest-mediated gate opening behaviour of the Co-based framework ZIF-67 |
Authors of publication | Jones, Isabelle M.; Turner, Gemma F.; Pitts, Kari; Powell, Rees; Riboldi-Tunnicliffe, Alan; Williamson, Rachel; Boer, Stephanie; Allen, Lauren; Moggach, Stephen A. |
Journal of publication | CrystEngComm |
Year of publication | 2023 |
Journal volume | 25 |
Journal issue | 47 |
Pages of publication | 6533 - 6538 |
a | 16.8057 ± 0.0004 Å |
b | 16.8057 ± 0.0004 Å |
c | 16.8057 ± 0.0004 Å |
α | 90° |
β | 90° |
γ | 90° |
Cell volume | 4746.5 ± 0.2 Å3 |
Cell temperature | 293 ± 2 K |
Ambient diffraction temperature | 293 ± 2 K |
Number of distinct elements | 4 |
Space group number | 217 |
Hermann-Mauguin space group symbol | I -4 3 m |
Hall space group symbol | I -4 2 3 |
Residual factor for all reflections | 0.0781 |
Residual factor for significantly intense reflections | 0.0721 |
Weighted residual factors for significantly intense reflections | 0.1893 |
Weighted residual factors for all reflections included in the refinement | 0.1947 |
Goodness-of-fit parameter for all reflections included in the refinement | 1.105 |
Diffraction radiation probe | x-ray |
Diffraction radiation wavelength | 0.71073 Å |
Diffraction radiation type | MoKα |