Information card for entry 7247823
Formula | C33 H63 Co2 N9 O32 P2 |
Calculated formula | C33 H63 Co2 N9 O32 P2 |
Title of publication | Mimic uracil–uracil base pairing: self-assembly and single crystal structure |
Authors of publication | Zhang, Menglei; Li, Zhongkui; Zhu, Yanhong; Yan, Li; Zhong, Xue; Zhang, Yijie; Li, Ziyao; Bai, Yixiang; Li, Hui |
Journal of publication | CrystEngComm |
Year of publication | 2024 |
Journal volume | 26 |
Journal issue | 3 |
Pages of publication | 261 - 267 |
a | 6.7824 ± 0.0006 Å |
b | 13.8721 ± 0.0012 Å |
c | 15.7504 ± 0.0014 Å |
α | 68.453 ± 0.003° |
β | 89.86 ± 0.003° |
γ | 80.963 ± 0.003° |
Cell volume | 1358.8 ± 0.2 Å3 |
Cell temperature | 296.15 K |
Ambient diffraction temperature | 296.15 K |
Number of distinct elements | 6 |
Space group number | 1 |
Hermann-Mauguin space group symbol | P 1 |
Hall space group symbol | P 1 |
Residual factor for all reflections | 0.1054 |
Residual factor for significantly intense reflections | 0.0644 |
Weighted residual factors for significantly intense reflections | 0.155 |
Weighted residual factors for all reflections included in the refinement | 0.178 |
Goodness-of-fit parameter for all reflections included in the refinement | 1.018 |
Diffraction radiation wavelength | 0.71073 Å |
Diffraction radiation type | MoKα |