Information card for entry 7247892
Formula | C20 H30 Cl2 Cu N8 O10 |
Calculated formula | C20 H30 Cl2 Cu N8 O10 |
Title of publication | Adaptable 2,5-bis((1,2,3-triazol-4-yl)methoxy)pyrazine ligands for the simple self-assembly of homoleptic 1D coordination polymers |
Authors of publication | Donaldson, Marryllyn E.; Dais, Tyson N.; Rowlands, Gareth J.; Matheson, Brodie E.; Plieger, Paul G. |
Journal of publication | CrystEngComm |
Year of publication | 2024 |
Journal volume | 26 |
Journal issue | 4 |
Pages of publication | 504 - 516 |
a | 18.58 ± 0.003 Å |
b | 16.19 ± 0.002 Å |
c | 9.4572 ± 0.0013 Å |
α | 90° |
β | 92.654 ± 0.011° |
γ | 90° |
Cell volume | 2841.8 ± 0.7 Å3 |
Cell temperature | 100 K |
Ambient diffraction temperature | 100 K |
Number of distinct elements | 6 |
Space group number | 15 |
Hermann-Mauguin space group symbol | C 1 2/c 1 |
Hall space group symbol | -C 2yc |
Residual factor for all reflections | 0.128 |
Residual factor for significantly intense reflections | 0.0782 |
Weighted residual factors for significantly intense reflections | 0.2024 |
Weighted residual factors for all reflections included in the refinement | 0.2453 |
Goodness-of-fit parameter for all reflections included in the refinement | 1.103 |
Diffraction radiation wavelength | 1.54178 Å |
Diffraction radiation type | CuKα |