Information card for entry 7248289
Formula | C24 H21 Eu O13 |
Calculated formula | C24 H21 Eu O13 |
Title of publication | Two multifunctional Dy(iii)-based metal–organic frameworks exhibiting proton conduction, magnetic properties and second-harmonic generation |
Authors of publication | Liao, Ya-Qing; Xiong, Tian-Zheng; Xie, Kang-Le; Zhang, Huan; Hu, Jun-Jie; Wen, He-Rui |
Journal of publication | CrystEngComm |
Year of publication | 2024 |
Journal volume | 26 |
Journal issue | 14 |
Pages of publication | 2033 - 2042 |
a | 10.0739 ± 0.0005 Å |
b | 10.1946 ± 0.0005 Å |
c | 12.6937 ± 0.0006 Å |
α | 76.507 ± 0.001° |
β | 86.196 ± 0.002° |
γ | 71.856 ± 0.001° |
Cell volume | 1204.59 ± 0.1 Å3 |
Cell temperature | 297 K |
Ambient diffraction temperature | 297 K |
Number of distinct elements | 4 |
Space group number | 2 |
Hermann-Mauguin space group symbol | P -1 |
Hall space group symbol | -P 1 |
Residual factor for all reflections | 0.0653 |
Residual factor for significantly intense reflections | 0.0409 |
Weighted residual factors for significantly intense reflections | 0.0596 |
Weighted residual factors for all reflections included in the refinement | 0.0656 |
Goodness-of-fit parameter for all reflections included in the refinement | 1.073 |
Diffraction radiation wavelength | 0.71073 Å |
Diffraction radiation type | MoKα |