Information card for entry 7248292
Chemical name | 1,2,4,5-Tetracyanobenzene-Fluorene |
Formula | C23 H12 N4 |
Calculated formula | C23 H12 N4 |
Title of publication | Synthesis and photophysical properties of charge transfer cocrystals based on TCNB and fluorene and its derivatives |
Authors of publication | Yao, Wenxiu; Wu, Pengfei; Xie, Yidan; Shen, Xinyu; Xia, Shuwei; Yu, Liangmin |
Journal of publication | CrystEngComm |
Year of publication | 2024 |
Journal volume | 26 |
Journal issue | 16 |
Pages of publication | 2155 - 2165 |
a | 7.1852 ± 0.0005 Å |
b | 7.8039 ± 0.0006 Å |
c | 7.9484 ± 0.0006 Å |
α | 73.766 ± 0.003° |
β | 83.955 ± 0.002° |
γ | 88.769 ± 0.003° |
Cell volume | 425.52 ± 0.05 Å3 |
Cell temperature | 170 K |
Ambient diffraction temperature | 170 K |
Number of distinct elements | 3 |
Space group number | 2 |
Hermann-Mauguin space group symbol | P -1 |
Hall space group symbol | -P 1 |
Residual factor for all reflections | 0.068 |
Residual factor for significantly intense reflections | 0.0471 |
Weighted residual factors for significantly intense reflections | 0.1153 |
Weighted residual factors for all reflections included in the refinement | 0.1325 |
Goodness-of-fit parameter for all reflections included in the refinement | 1.058 |
Diffraction radiation wavelength | 0.71073 Å |
Diffraction radiation type | MoKα |