Information card for entry 7248463
Chemical name | cis-Decalin (HT form refined in triclinic SG) |
Formula | C10 H18 |
Calculated formula | C10 H18 |
Title of publication | Structural chemistry of decalins and perfluorodecalins |
Authors of publication | Paska, Bartłomiej; Cichowicz, Grzegorz; Rzepiński, Patryk; Cyrański, Michał Ksawery; Dobrzycki, Łukasz; Boese, Roland |
Journal of publication | CrystEngComm |
Year of publication | 2024 |
Journal volume | 26 |
Journal issue | 19 |
Pages of publication | 2474 - 2490 |
a | 8.2823 ± 0.0005 Å |
b | 10.6037 ± 0.0005 Å |
c | 11.9909 ± 0.0007 Å |
α | 113.428 ± 0.0016° |
β | 90.0435 ± 0.0019° |
γ | 112.888 ± 0.0017° |
Cell volume | 875.02 ± 0.09 Å3 |
Cell temperature | 150 ± 2 K |
Ambient diffraction temperature | 150 ± 2 K |
Number of distinct elements | 2 |
Space group number | 2 |
Hermann-Mauguin space group symbol | P -1 |
Hall space group symbol | -P 1 |
Residual factor for all reflections | 0.05 |
Residual factor for significantly intense reflections | 0.0414 |
Weighted residual factors for significantly intense reflections | 0.0978 |
Weighted residual factors for all reflections included in the refinement | 0.1061 |
Goodness-of-fit parameter for all reflections included in the refinement | 1.027 |
Diffraction radiation wavelength | 0.71073 Å |
Diffraction radiation type | MoKα |