Information card for entry 7248468
Chemical name | cis-Decalin (LT form refined in triclinic SG) |
Formula | C10 H18 |
Calculated formula | C10 H18 |
Title of publication | Structural chemistry of decalins and perfluorodecalins |
Authors of publication | Paska, Bartłomiej; Cichowicz, Grzegorz; Rzepiński, Patryk; Cyrański, Michał Ksawery; Dobrzycki, Łukasz; Boese, Roland |
Journal of publication | CrystEngComm |
Year of publication | 2024 |
Journal volume | 26 |
Journal issue | 19 |
Pages of publication | 2474 - 2490 |
a | 8.2699 ± 0.0007 Å |
b | 10.5607 ± 0.0007 Å |
c | 11.9762 ± 0.001 Å |
α | 113.534 ± 0.002° |
β | 90.179 ± 0.003° |
γ | 112.733 ± 0.003° |
Cell volume | 869 ± 0.12 Å3 |
Cell temperature | 130 ± 2 K |
Ambient diffraction temperature | 130 ± 2 K |
Number of distinct elements | 2 |
Space group number | 2 |
Hermann-Mauguin space group symbol | P -1 |
Hall space group symbol | -P 1 |
Residual factor for all reflections | 0.048 |
Residual factor for significantly intense reflections | 0.0409 |
Weighted residual factors for significantly intense reflections | 0.0937 |
Weighted residual factors for all reflections included in the refinement | 0.1004 |
Goodness-of-fit parameter for all reflections included in the refinement | 1.044 |
Diffraction radiation wavelength | 0.71073 Å |
Diffraction radiation type | MoKα |