Information card for entry 7248481
Chemical name | cis-Decalin (HT form refined in triclinic SG) |
Formula | C10 H18 |
Calculated formula | C10 H18 |
Title of publication | Structural chemistry of decalins and perfluorodecalins |
Authors of publication | Paska, Bartłomiej; Cichowicz, Grzegorz; Rzepiński, Patryk; Cyrański, Michał Ksawery; Dobrzycki, Łukasz; Boese, Roland |
Journal of publication | CrystEngComm |
Year of publication | 2024 |
Journal volume | 26 |
Journal issue | 19 |
Pages of publication | 2474 - 2490 |
a | 8.2852 ± 0.0003 Å |
b | 10.6314 ± 0.0003 Å |
c | 11.9844 ± 0.0004 Å |
α | 113.141 ± 0.0009° |
β | 90.0216 ± 0.001° |
γ | 112.856 ± 0.0009° |
Cell volume | 879.77 ± 0.05 Å3 |
Cell temperature | 170 ± 2 K |
Ambient diffraction temperature | 170 ± 2 K |
Number of distinct elements | 2 |
Space group number | 2 |
Hermann-Mauguin space group symbol | P -1 |
Hall space group symbol | -P 1 |
Residual factor for all reflections | 0.0551 |
Residual factor for significantly intense reflections | 0.0442 |
Weighted residual factors for significantly intense reflections | 0.1074 |
Weighted residual factors for all reflections included in the refinement | 0.1194 |
Goodness-of-fit parameter for all reflections included in the refinement | 1.055 |
Diffraction radiation wavelength | 0.71073 Å |
Diffraction radiation type | MoKα |