Information card for entry 7248485
Chemical name | cis-Decalin (HT form refined in triclinic SG) |
Formula | C10 H18 |
Calculated formula | C10 H18 |
Title of publication | Structural chemistry of decalins and perfluorodecalins |
Authors of publication | Paska, Bartłomiej; Cichowicz, Grzegorz; Rzepiński, Patryk; Cyrański, Michał Ksawery; Dobrzycki, Łukasz; Boese, Roland |
Journal of publication | CrystEngComm |
Year of publication | 2024 |
Journal volume | 26 |
Journal issue | 19 |
Pages of publication | 2474 - 2490 |
a | 8.286 ± 0.0007 Å |
b | 10.6634 ± 0.0007 Å |
c | 11.9779 ± 0.0009 Å |
α | 112.795 ± 0.002° |
β | 90.023 ± 0.002° |
γ | 112.784 ± 0.002° |
Cell volume | 885.34 ± 0.12 Å3 |
Cell temperature | 190 ± 2 K |
Ambient diffraction temperature | 190 ± 2 K |
Number of distinct elements | 2 |
Space group number | 2 |
Hermann-Mauguin space group symbol | P -1 |
Hall space group symbol | -P 1 |
Residual factor for all reflections | 0.0635 |
Residual factor for significantly intense reflections | 0.0493 |
Weighted residual factors for significantly intense reflections | 0.1195 |
Weighted residual factors for all reflections included in the refinement | 0.1341 |
Goodness-of-fit parameter for all reflections included in the refinement | 1.055 |
Diffraction radiation wavelength | 0.71073 Å |
Diffraction radiation type | MoKα |