Information card for entry 7248684
Formula | C30 H29 Cl2 F21 N2 O4 |
Calculated formula | C30 H29 Cl2 F21 N2 O4 |
Title of publication | New melphalan derivatives for the treatment of retinoblastoma in combination with thermotherapy |
Authors of publication | Zebret, Soumaila; Hadiji, Mouna; Romano-deGea, Jan; Bornet, Aurélien; Ortiz, Daniel; Fadaei Tirani, Farzaneh; Stathopoulos, Christina; Nowak-Sliwinska, Patrycja; Munier, Francis; Dyson, Paul Joseph |
Journal of publication | RSC Medicinal Chemistry |
Year of publication | 2024 |
a | 10.9654 ± 0.0012 Å |
b | 34.582 ± 0.006 Å |
c | 9.7715 ± 0.0013 Å |
α | 90° |
β | 90° |
γ | 90° |
Cell volume | 3705.4 ± 0.9 Å3 |
Cell temperature | 140 ± 0.1 K |
Ambient diffraction temperature | 140 ± 0.1 K |
Number of distinct elements | 6 |
Space group number | 29 |
Hermann-Mauguin space group symbol | P c a 21 |
Hall space group symbol | P 2c -2ac |
Residual factor for all reflections | 0.2309 |
Residual factor for significantly intense reflections | 0.1547 |
Weighted residual factors for significantly intense reflections | 0.3789 |
Weighted residual factors for all reflections included in the refinement | 0.4328 |
Goodness-of-fit parameter for all reflections included in the refinement | 1.212 |
Diffraction radiation probe | x-ray |
Diffraction radiation wavelength | 1.54184 Å |
Diffraction radiation type | CuKα |