Information card for entry 7248755
Formula | C7 H16 Cd Cl3 N |
Calculated formula | C7 H16 Cd Cl3 N |
Title of publication | Successive high-temperature phase transitions triggered dielectric switching in a one-dimensional hybrid perovskite with blue emission |
Authors of publication | Hua, Xiu-Ni; Cai, Zhuoer; Huang, Tian-Tian; Cui, Jing-Han; Shi, Xian; Zhang, Xiang; Zhang, Yinan; Chen, Jian; Xu, Kai; Duan, Hai-Bao |
Journal of publication | CrystEngComm |
Year of publication | 2024 |
Journal volume | 26 |
Journal issue | 25 |
Pages of publication | 3325 - 3330 |
a | 7.5694 ± 0.0014 Å |
b | 24.091 ± 0.004 Å |
c | 6.6715 ± 0.0012 Å |
α | 90° |
β | 90° |
γ | 90° |
Cell volume | 1216.6 ± 0.4 Å3 |
Cell temperature | 448 K |
Ambient diffraction temperature | 448 K |
Number of distinct elements | 5 |
Space group number | 63 |
Hermann-Mauguin space group symbol | C m c m |
Hall space group symbol | -C 2c 2 |
Residual factor for all reflections | 0.037 |
Residual factor for significantly intense reflections | 0.0326 |
Weighted residual factors for significantly intense reflections | 0.0853 |
Weighted residual factors for all reflections included in the refinement | 0.0898 |
Goodness-of-fit parameter for all reflections included in the refinement | 1.088 |
Diffraction radiation wavelength | 0.71073 Å |
Diffraction radiation type | MoKα |