Information card for entry 7248797
Formula | C21 H23 Cl N4 O6 |
Calculated formula | C21 H23 Cl N4 O6 |
Title of publication | Theoretical and experimental study of pharmaceutical salts: a case of trimethoprim |
Authors of publication | Zhang, Liang; Wu, Di; Zhang, Menglong; Yu, Fuhai; Bao, Ying; Xie, Chuang; Hou, Baohong; Jing, Dingding; Zhang, Chuntao; Chen, Wei |
Journal of publication | CrystEngComm |
Year of publication | 2024 |
Journal volume | 26 |
Journal issue | 28 |
Pages of publication | 3808 - 3822 |
a | 11.7204 ± 0.0002 Å |
b | 8.4362 ± 0.0002 Å |
c | 21.7076 ± 0.0005 Å |
α | 90° |
β | 98.393 ± 0.002° |
γ | 90° |
Cell volume | 2123.37 ± 0.08 Å3 |
Cell temperature | 113.15 K |
Ambient diffraction temperature | 113.15 K |
Number of distinct elements | 5 |
Space group number | 14 |
Hermann-Mauguin space group symbol | P 1 21/n 1 |
Hall space group symbol | -P 2yn |
Residual factor for all reflections | 0.0533 |
Residual factor for significantly intense reflections | 0.0441 |
Weighted residual factors for significantly intense reflections | 0.1099 |
Weighted residual factors for all reflections included in the refinement | 0.1178 |
Goodness-of-fit parameter for all reflections included in the refinement | 1.036 |
Diffraction radiation probe | x-ray |
Diffraction radiation wavelength | 0.71073 Å |
Diffraction radiation type | MoKα |