Information card for entry 7248899
Formula | C204 H195 Dy4 N9 O36 |
Calculated formula | C204 H195 Dy4 N9 O36 |
Title of publication | Construction of porous 2D Dy3+ metal organic frameworks: solvent responsive magnetic dynamics under 0 Oe dc field and luminescent sensors for Fe3+ ions |
Authors of publication | Gou, Yangyang; Gao, Ming; Wu, Yunlong; Zhou, Wei; Feng, Jiancheng; Zhang, Sheng; Wang, Xiaohong; Yin, Bing |
Journal of publication | CrystEngComm |
Year of publication | 2024 |
Journal volume | 26 |
Journal issue | 30 |
Pages of publication | 4057 - 4072 |
a | 40.69949 ± 0.00012 Å |
b | 18.17532 ± 0.00006 Å |
c | 25.71644 ± 0.00009 Å |
α | 90° |
β | 100.858 ± 0.0003° |
γ | 90° |
Cell volume | 18682.6 ± 0.11 Å3 |
Cell temperature | 293 ± 2 K |
Ambient diffraction temperature | 293 ± 2 K |
Number of distinct elements | 5 |
Space group number | 14 |
Hermann-Mauguin space group symbol | P 1 21/c 1 |
Hall space group symbol | -P 2ybc |
Residual factor for all reflections | 0.0348 |
Residual factor for significantly intense reflections | 0.0321 |
Weighted residual factors for significantly intense reflections | 0.097 |
Weighted residual factors for all reflections included in the refinement | 0.0986 |
Goodness-of-fit parameter for all reflections included in the refinement | 1.162 |
Diffraction radiation wavelength | 1.54184 Å |
Diffraction radiation type | CuKα |