Information card for entry 7249147
Formula | C16 H22 N8 Ni O4 |
Calculated formula | C16 H22 N8 Ni O4 |
Title of publication | Impact of the number of hydrogen bonds on proton conductivity in metallo-hydrogen-bonded organic frameworks: the more the number of hydrogen bonds, the better the proton conductivity at the maximum relative humidity |
Authors of publication | Feng, Shaoqiang; Xie, Fengxia; Wan, Chengan; Zhang, Feng; Feng, Lei; Wen, Chen; Liang, Xiaoqiang |
Journal of publication | CrystEngComm |
Year of publication | 2024 |
Journal volume | 26 |
Journal issue | 35 |
Pages of publication | 4855 - 4870 |
a | 13.9347 ± 0.0015 Å |
b | 7.1605 ± 0.0008 Å |
c | 8.9773 ± 0.001 Å |
α | 90° |
β | 95.289 ± 0.004° |
γ | 90° |
Cell volume | 891.94 ± 0.17 Å3 |
Cell temperature | 170 ± 2 K |
Ambient diffraction temperature | 170 ± 2 K |
Number of distinct elements | 5 |
Space group number | 12 |
Hermann-Mauguin space group symbol | C 1 2/m 1 |
Hall space group symbol | -C 2y |
Residual factor for all reflections | 0.0378 |
Residual factor for significantly intense reflections | 0.035 |
Weighted residual factors for significantly intense reflections | 0.0845 |
Weighted residual factors for all reflections included in the refinement | 0.0859 |
Goodness-of-fit parameter for all reflections included in the refinement | 1.084 |
Diffraction radiation wavelength | 1.34138 Å |
Diffraction radiation type | GaKα |