Information card for entry 7249156
Formula | C16 H24 Au B F4 N4 O4 |
Calculated formula | C16 H24 Au B F4 N4 O4 |
Title of publication | Gold(I) and Gold(III) Carbene Complexes from the Marine Betaine Norzooanemonin: Inhibition of Thioredoxin Reductase, Anti-proliferative and Antimicrobial Activity |
Authors of publication | Mahdavi, Seyedehmahbobeh; Bockfeld, Dirk; Esarev, Igor V.; Lippmann, Petra; Frank, René; Brönstrup, Mark; Ott, Ingo; Tamm, Matthias |
Journal of publication | RSC Medicinal Chemistry |
Year of publication | 2024 |
a | 7.02 ± 0.0006 Å |
b | 10.3525 ± 0.001 Å |
c | 15.2507 ± 0.0017 Å |
α | 86.57 ± 0.008° |
β | 79.101 ± 0.009° |
γ | 76.542 ± 0.008° |
Cell volume | 1058.32 ± 0.19 Å3 |
Cell temperature | 100 ± 2 K |
Ambient diffraction temperature | 100 ± 2 K |
Number of distinct elements | 7 |
Space group number | 2 |
Hermann-Mauguin space group symbol | P -1 |
Hall space group symbol | -P 1 |
Residual factor for all reflections | 0.1674 |
Residual factor for significantly intense reflections | 0.1326 |
Weighted residual factors for significantly intense reflections | 0.3468 |
Weighted residual factors for all reflections included in the refinement | 0.3902 |
Goodness-of-fit parameter for all reflections included in the refinement | 1.613 |
Diffraction radiation probe | x-ray |
Diffraction radiation wavelength | 1.54184 Å |
Diffraction radiation type | CuKα |