Information card for entry 7249171
Chemical name | methyl 5-((3aS,4S,6R,6aR)-6-(6-amino-9H-purin-9-yl)-2,2-dimethyltetrahydrofuro[3,4-d][1,3]dioxole-4-carboxamido)-2-fluorobenzoate |
Formula | C23 H24.2 F N7 O6.1 |
Calculated formula | C23 H24.2 F N7 O6.1 |
Title of publication | Discovery of highly potent SARS-CoV-2 nsp14 methyltransferase inhibitors based on adenosine 5′-carboxamides |
Authors of publication | Kocek, Hugo; Chalupská, Dominika; Dejmek, Milan; Dvořáková, Alexandra; Zgarbová, Michala; Šála, Michal; Chalupský, Karel; Krafčíková, Petra; Otava, Tomáš; Drexler, Matus; Procházková, Eliška; Klepetářová, Blanka; Štefek, Milan; Kozic, Ján; Mertlíková-Kaiserová, Helena; Boura, Evzen; Weber, Jan; Nencka, Radim |
Journal of publication | RSC Medicinal Chemistry |
Year of publication | 2024 |
a | 7.9953 ± 0.0002 Å |
b | 15.3161 ± 0.0004 Å |
c | 19.6255 ± 0.0005 Å |
α | 90° |
β | 90° |
γ | 90° |
Cell volume | 2403.28 ± 0.11 Å3 |
Cell temperature | 180 K |
Ambient diffraction temperature | 180 K |
Number of distinct elements | 5 |
Space group number | 19 |
Hermann-Mauguin space group symbol | P 21 21 21 |
Hall space group symbol | P 2ac 2ab |
Residual factor for all reflections | 0.0327 |
Residual factor for significantly intense reflections | 0.0313 |
Weighted residual factors for all reflections | 0.0333 |
Weighted residual factors for significantly intense reflections | 0.0311 |
Weighted residual factors for all reflections included in the refinement | 0.0311 |
Goodness-of-fit parameter for all reflections included in the refinement | 0.9432 |
Diffraction radiation probe | x-ray |
Diffraction radiation wavelength | 1.54178 Å |
Diffraction radiation type | CuKα |