Information card for entry 7249349
Formula | C42 H100 Gd O60 P7 W12 |
Calculated formula | C42 H100 Gd O60 P7 W12 |
Title of publication | A series of rare-earth phosphine-oxygen complexes containing [PW12O40]3- with highly efficient photocatalytic degradation of MB |
Authors of publication | Li, Ying-Yu; Qiu, Qi-Ming; Fan, Sijie; Xu, Jian-Jie; Mou, Wen-Long; Hou, Chuan-Bing; Liu, Min; Yang, Yuping; Dai, Lixiong; Han, Hong-Liang; Jin, Qiong-Hua |
Journal of publication | CrystEngComm |
Year of publication | 2024 |
a | 15.902 ± 0.0016 Å |
b | 16.2959 ± 0.0018 Å |
c | 21.296 ± 0.002 Å |
α | 79.254 ± 0.002° |
β | 83.242 ± 0.003° |
γ | 88.856 ± 0.003° |
Cell volume | 5384.1 ± 1 Å3 |
Cell temperature | 293 ± 2 K |
Ambient diffraction temperature | 293 ± 2 K |
Number of distinct elements | 6 |
Space group number | 2 |
Hermann-Mauguin space group symbol | P -1 |
Hall space group symbol | -P 1 |
Residual factor for all reflections | 0.1418 |
Residual factor for significantly intense reflections | 0.0795 |
Weighted residual factors for significantly intense reflections | 0.1811 |
Weighted residual factors for all reflections included in the refinement | 0.1994 |
Goodness-of-fit parameter for all reflections included in the refinement | 1.076 |
Diffraction radiation wavelength | 0.71073 Å |
Diffraction radiation type | MoKα |