Information card for entry 7249491
Formula |
C10 H30 Cl7 In N4 O |
Calculated formula |
C10 H30 Cl7 In N4 O |
Title of publication |
Zero-Dimensional Organic-inorganic Hybrid Indium Halide Perovskite with Broadband Yellow Light Emission |
Authors of publication |
Wang, Qi; Jiang, Wei; Xuan, Peng-Yao; Zhao, Ke; Fu, Xiu-Yue; Zhang, Xiao-Rui; Lei, Xiao-Wu; Yue, Cheng-Yang; Kong, Xiang-Wen |
Journal of publication |
CrystEngComm |
Year of publication |
2024 |
a |
28.989 ± 0.009 Å |
b |
9.949 ± 0.003 Å |
c |
7.723 ± 0.003 Å |
α |
90° |
β |
90° |
γ |
90° |
Cell volume |
2227.4 ± 1.3 Å3 |
Cell temperature |
296.15 K |
Ambient diffraction temperature |
296.15 K |
Number of distinct elements |
6 |
Space group number |
62 |
Hermann-Mauguin space group symbol |
P n m a |
Hall space group symbol |
-P 2ac 2n |
Residual factor for all reflections |
0.0378 |
Residual factor for significantly intense reflections |
0.0277 |
Weighted residual factors for significantly intense reflections |
0.0586 |
Weighted residual factors for all reflections included in the refinement |
0.062 |
Goodness-of-fit parameter for all reflections included in the refinement |
1.016 |
Diffraction radiation wavelength |
0.71073 Å |
Diffraction radiation type |
MoKα |
Yes |
Yes |
No |