Information card for entry 7249549
Formula
C28 H24 N2 O3 S2
Calculated formula
C28 H24 N2 O3 S2
Title of publication
EtOH-mediated cascade C(sp3)–H alkylation via aromatization-driven [1,6]-hydride transfer: green and divergent synthesis of spirocyclic azepino[4,3,2-cd]indoles
Authors of publication
Shen, Yao-Bin; Zhuang, Qian-Hao; Wang, Xiao-Lin; An, Xiao-De; Qiu, Bin; Shi, Tiesheng; Xiao, Jian
Journal of publication
Green Chemistry
Year of publication
2024
a
24.189 ± 0.004 Å
b
8.6185 ± 0.0015 Å
c
11.782 ± 0.002 Å
α
90°
β
103.147 ± 0.005°
γ
90°
Cell volume
2391.8 ± 0.7 Å3
Cell temperature
273 ± 2 K
Ambient diffraction temperature
273 ± 2 K
Number of distinct elements
5
Space group number
14
Hermann-Mauguin space group symbol
P 1 21/c 1
Hall space group symbol
-P 2ybc
Residual factor for all reflections
0.1782
Residual factor for significantly intense reflections
0.0952
Weighted residual factors for significantly intense reflections
0.1487
Weighted residual factors for all reflections included in the refinement
0.1835
Goodness-of-fit parameter for all reflections included in the refinement
1.099
Diffraction radiation wavelength
0.71073 Å
Diffraction radiation type
MoKα
Yes
No
No