Information card for entry 7700019
Formula | C44 H61 Al N2 Si2 |
Calculated formula | C44 H61 Al N2 Si2 |
Title of publication | Reaction of an N/Al FLP-based aluminum hydride toward alkynes: deprotonated alumination versus hydroalumination with regioselective cis-addition character. |
Authors of publication | Chen, Yilin; Jiang, Wenjun; Li, Bin; Fu, Gang; Chen, Shimin; Zhu, Hongping |
Journal of publication | Dalton transactions (Cambridge, England : 2003) |
Year of publication | 2019 |
Journal volume | 48 |
Journal issue | 25 |
Pages of publication | 9152 - 9160 |
a | 11.3883 ± 0.0005 Å |
b | 19.6761 ± 0.0007 Å |
c | 18.8444 ± 0.0007 Å |
α | 90° |
β | 100.654 ± 0.004° |
γ | 90° |
Cell volume | 4149.8 ± 0.3 Å3 |
Cell temperature | 173 ± 2 K |
Ambient diffraction temperature | 173 ± 2 K |
Number of distinct elements | 5 |
Space group number | 14 |
Hermann-Mauguin space group symbol | P 1 21/c 1 |
Hall space group symbol | -P 2ybc |
Residual factor for all reflections | 0.0802 |
Residual factor for significantly intense reflections | 0.0609 |
Weighted residual factors for significantly intense reflections | 0.1419 |
Weighted residual factors for all reflections included in the refinement | 0.1526 |
Goodness-of-fit parameter for all reflections included in the refinement | 1.046 |
Diffraction radiation wavelength | 0.71073 Å |
Diffraction radiation type | MoKα |