Information card for entry 7700060
Formula
Mn2 Na3 O6 Sb
Calculated formula
Mn2 Na3 O6 Sb
Title of publication
New series of honeycomb ordered oxides, Na<sub>3</sub>M<sub>2</sub>SbO<sub>6</sub> (M(ii) = Mn, Fe, (Mn, Fe), (Mn, Co)): synthesis, structure and magnetic properties.
Authors of publication
Yadav, Dileep Kumar; Sethi, Aanchal; Shalu, ?; Uma, S.
Journal of publication
Dalton transactions (Cambridge, England : 2003)
Year of publication
2019
Journal volume
48
Journal issue
24
Pages of publication
8955 - 8965
a
5.48987 ± 0.00025 Å
b
9.4841 ± 0.0004 Å
c
5.7109 ± 0.0002 Å
α
90°
β
108.985 ± 0.0031°
γ
90°
Cell volume
281.17 ± 0.02 Å3
Cell temperature
298 K
Ambient diffraction temperature
298 K
Number of distinct elements
4
Space group number
12
Hermann-Mauguin space group symbol
C 1 2/m 1
Hall space group symbol
-C 2y
Method of determination
powder diffraction
Diffraction radiation wavelength
1.54175 Å
Diffraction radiation type
CuKα
Yes
No
No