Information card for entry 7700080
Formula | C6 H8 Cu I2 N |
Calculated formula | C6 H8 Cu I2 N |
Title of publication | Organic cation directed one-dimensional cuprous halide compounds: syntheses, crystal structures and photoluminescence properties. |
Authors of publication | Yue, Cheng-Yang; Lin, Na; Gao, Lu; Jin, Ying-Xue; Liu, Zhao-Yang; Cao, Yao-Yao; Han, Sha-Sha; Lian, Xi-Kai; Hu, Bing; Lei, Xiao-Wu |
Journal of publication | Dalton transactions (Cambridge, England : 2003) |
Year of publication | 2019 |
Journal volume | 48 |
Journal issue | 27 |
Pages of publication | 10151 - 10159 |
a | 13.102 ± 0.01 Å |
b | 18.403 ± 0.014 Å |
c | 16.48 ± 0.013 Å |
α | 90° |
β | 90° |
γ | 90° |
Cell volume | 3974 ± 5 Å3 |
Cell temperature | 293 ± 2 K |
Ambient diffraction temperature | 293 ± 2 K |
Number of distinct elements | 5 |
Space group number | 64 |
Hermann-Mauguin space group symbol | C m c e |
Hall space group symbol | -C 2ac 2 |
Residual factor for all reflections | 0.0382 |
Residual factor for significantly intense reflections | 0.0333 |
Weighted residual factors for significantly intense reflections | 0.0958 |
Weighted residual factors for all reflections included in the refinement | 0.0998 |
Goodness-of-fit parameter for all reflections included in the refinement | 1.067 |
Diffraction radiation wavelength | 0.71073 Å |
Diffraction radiation type | MoKα |