Information card for entry 7700085
Formula | C56 H54 Cl7 P4 Rh |
Calculated formula | C56 H54 Cl7 P4 Rh |
Title of publication | Synthesis and characterization of rhodium-aluminum heterobimetallic complexes tethered by a 1,3-bis(diphenylphosphino)-2-propanoxy group. |
Authors of publication | Li, Zhongjing; Yokley, Timothy W.; Tran, Sheila L.; Zong, Jie; Schley, Nathan D.; Brewster, Timothy P. |
Journal of publication | Dalton transactions (Cambridge, England : 2003) |
Year of publication | 2019 |
Journal volume | 48 |
Journal issue | 24 |
Pages of publication | 8782 - 8790 |
a | 11.0851 ± 0.0004 Å |
b | 12.1298 ± 0.0004 Å |
c | 21.8397 ± 0.0007 Å |
α | 88.981 ± 0.003° |
β | 77.421 ± 0.003° |
γ | 69.857 ± 0.003° |
Cell volume | 2685.53 ± 0.17 Å3 |
Cell temperature | 100 ± 0.1 K |
Ambient diffraction temperature | 100 ± 0.1 K |
Number of distinct elements | 5 |
Space group number | 2 |
Hermann-Mauguin space group symbol | P -1 |
Hall space group symbol | -P 1 |
Residual factor for all reflections | 0.0528 |
Residual factor for significantly intense reflections | 0.0417 |
Weighted residual factors for significantly intense reflections | 0.0856 |
Weighted residual factors for all reflections included in the refinement | 0.092 |
Goodness-of-fit parameter for all reflections included in the refinement | 1.035 |
Diffraction radiation probe | x-ray |
Diffraction radiation wavelength | 0.71073 Å |
Diffraction radiation type | MoKα |