Information card for entry 7700096
Formula | C12 H69 Cl Co2 Mo7 N12 O34 |
Calculated formula | C12 H69 Cl Co2 Mo7 N12 O34 |
Title of publication | The synthesis, structure and catalytic properties of the [Mo<sub>7</sub>O<sub>24</sub>(μ-Mo<sub>8</sub>O<sub>26</sub>)Mo<sub>7</sub>O<sub>24</sub>]<sup>16-</sup> anion formed via two intermediate heptamolybdates [Co(en)<sub>3</sub>]<sub>2</sub>[NaMo<sub>7</sub>O<sub>24</sub>]Cl·nH<sub>2</sub>O and (H<sub>3</sub>O)[Co(en)<sub>3</sub>]<sub>2</sub>[Mo<sub>7</sub>O<sub>24</sub>]Cl·9H<sub>2</sub>O. |
Authors of publication | Damjanović, Vladimir; Pisk, Jana; Kuzman, Dino; Agustin, Dominique; Vrdoljak, Višnja; Stilinović, Vladimir; Cindrić, Marina |
Journal of publication | Dalton transactions (Cambridge, England : 2003) |
Year of publication | 2019 |
Journal volume | 48 |
Journal issue | 27 |
Pages of publication | 9974 - 9983 |
a | 16.2589 ± 0.0009 Å |
b | 15.4723 ± 0.0004 Å |
c | 10.7082 ± 0.0004 Å |
α | 90° |
β | 114.916 ± 0.005° |
γ | 90° |
Cell volume | 2443.1 ± 0.2 Å3 |
Cell temperature | 295 ± 2 K |
Ambient diffraction temperature | 295 ± 2 K |
Number of distinct elements | 7 |
Space group number | 5 |
Hermann-Mauguin space group symbol | C 1 2 1 |
Hall space group symbol | C 2y |
Residual factor for all reflections | 0.015 |
Residual factor for significantly intense reflections | 0.0146 |
Weighted residual factors for significantly intense reflections | 0.0353 |
Weighted residual factors for all reflections included in the refinement | 0.0353 |
Goodness-of-fit parameter for all reflections included in the refinement | 1.065 |
Diffraction radiation wavelength | 0.71073 Å |
Diffraction radiation type | MoKα |