Information card for entry 7700103
Common name | fur-Se 100 K |
Chemical name | [Fe2(NCSe)4(furtrz)5].furtrz.MeOH |
Formula | C47 H40 Fe2 N28 O7 Se4 |
Calculated formula | C46 H36 Fe2 N28 O6 Se4 |
Title of publication | Heteroatom substitution effects in spin crossover dinuclear complexes. |
Authors of publication | Zaiter, Samantha; Kirk, Charlotte; Taylor, Matthew; Klein, Y. Maximilian; Housecroft, Catherine E.; Sciortino, Natasha F.; Clements, John E.; Cooper, Richard I.; Kepert, Cameron J.; Neville, Suzanne M. |
Journal of publication | Dalton transactions (Cambridge, England : 2003) |
Year of publication | 2019 |
Journal volume | 48 |
Journal issue | 21 |
Pages of publication | 7337 - 7343 |
a | 11.6669 ± 0.0006 Å |
b | 13.585 ± 0.0006 Å |
c | 20.2298 ± 0.001 Å |
α | 82.736 ± 0.004° |
β | 75.108 ± 0.004° |
γ | 77.118 ± 0.004° |
Cell volume | 3012.5 ± 0.3 Å3 |
Cell temperature | 100 ± 2 K |
Ambient diffraction temperature | 100 ± 2 K |
Number of distinct elements | 6 |
Space group number | 2 |
Hermann-Mauguin space group symbol | P -1 |
Hall space group symbol | -P 1 |
Residual factor for all reflections | 0.0871 |
Residual factor for significantly intense reflections | 0.0522 |
Weighted residual factors for significantly intense reflections | 0.1086 |
Weighted residual factors for all reflections included in the refinement | 0.1227 |
Goodness-of-fit parameter for all reflections included in the refinement | 1 |
Diffraction radiation wavelength | 0.71073 Å |
Diffraction radiation type | MoKα |