Information card for entry 7700141
Formula | C21 H14 Cl I2 N3 Zn |
Calculated formula | C21 H14 Cl I2 N3 Zn |
Title of publication | Synthesis, characterization, photoluminescence, anti-tumor activity, DFT calculations and molecular docking with proteins of zinc(ii) halogen substituted terpyridine compounds. |
Authors of publication | Liang, Xing; Jiang, Jinzhang; Xue, Xingyong; Huang, Ling; Ding, Xuanxuan; Nong, Dongmei; Chen, Hailan; Pan, Lixia; Ma, Zhen |
Journal of publication | Dalton transactions (Cambridge, England : 2003) |
Year of publication | 2019 |
Journal volume | 48 |
Journal issue | 28 |
Pages of publication | 10488 - 10504 |
a | 14.04 ± 0.003 Å |
b | 15.296 ± 0.003 Å |
c | 19.559 ± 0.004 Å |
α | 90° |
β | 90° |
γ | 90° |
Cell volume | 4200.4 ± 1.5 Å3 |
Cell temperature | 298 ± 2 K |
Ambient diffraction temperature | 298 ± 2 K |
Number of distinct elements | 6 |
Space group number | 61 |
Hermann-Mauguin space group symbol | P b c a |
Hall space group symbol | -P 2ac 2ab |
Residual factor for all reflections | 0.0599 |
Residual factor for significantly intense reflections | 0.0367 |
Weighted residual factors for significantly intense reflections | 0.088 |
Weighted residual factors for all reflections included in the refinement | 0.1046 |
Goodness-of-fit parameter for all reflections included in the refinement | 1.056 |
Diffraction radiation wavelength | 0.71073 Å |
Diffraction radiation type | MoKα |