Information card for entry 7700149
Formula | C12 H16 Ca N12 O16 Rb2 |
Calculated formula | C12 H16 Ca N12 O16 Rb2 |
Title of publication | A rich structural chemistry in π-conjugated hydroisocyanurates: layered structures of A<sub>2</sub>B(H<sub>2</sub>C<sub>3</sub>N<sub>3</sub>O<sub>3</sub>)<sub>4</sub>·nH<sub>2</sub>O (A = K, Rb, Cs; B = Mg, Ca; n = 4, 10) with high ultraviolet transparency and strong optical anisotropy. |
Authors of publication | Meng, Xianghe; Liang, Fei; Kang, Kaijin; Tang, Jian; Huang, Qian; Yin, Wenlong; Lin, Zheshuai; Xia, Mingjun |
Journal of publication | Dalton transactions (Cambridge, England : 2003) |
Year of publication | 2019 |
Journal volume | 48 |
Journal issue | 25 |
Pages of publication | 9048 - 9052 |
a | 10.7222 ± 0.0008 Å |
b | 16.4782 ± 0.001 Å |
c | 7.1339 ± 0.0005 Å |
α | 90° |
β | 99.95 ± 0.007° |
γ | 90° |
Cell volume | 1241.48 ± 0.15 Å3 |
Cell temperature | 293 ± 2 K |
Ambient diffraction temperature | 293 ± 2 K |
Number of distinct elements | 6 |
Space group number | 12 |
Hermann-Mauguin space group symbol | C 1 2/m 1 |
Hall space group symbol | -C 2y |
Residual factor for all reflections | 0.038 |
Residual factor for significantly intense reflections | 0.0344 |
Weighted residual factors for significantly intense reflections | 0.0894 |
Weighted residual factors for all reflections included in the refinement | 0.091 |
Goodness-of-fit parameter for all reflections included in the refinement | 1.091 |
Diffraction radiation wavelength | 0.71073 Å |
Diffraction radiation type | MoKα |