Information card for entry 7700214
Formula | C32 H37 B N6 P S2 Y |
Calculated formula | C32 H37 B N6 P S2 Y |
Title of publication | Oxidation and chalcogenylative disproportionation of anionic phosphide ligands in yttrium complexes with elemental sulfur and selenium. |
Authors of publication | Zhang, Fangjun; Yi, Weiyin; Zhang, Jie; You, Qing; Weng, Linhong; Zhou, Xigeng |
Journal of publication | Dalton transactions (Cambridge, England : 2003) |
Year of publication | 2019 |
Journal volume | 48 |
Journal issue | 28 |
Pages of publication | 10596 - 10603 |
a | 10.927 ± 0.003 Å |
b | 11.211 ± 0.003 Å |
c | 14.074 ± 0.004 Å |
α | 90.272 ± 0.004° |
β | 94.118 ± 0.004° |
γ | 107.037 ± 0.004° |
Cell volume | 1643.6 ± 0.8 Å3 |
Cell temperature | 296 ± 2 K |
Ambient diffraction temperature | 296 ± 2 K |
Number of distinct elements | 7 |
Space group number | 2 |
Hermann-Mauguin space group symbol | P -1 |
Hall space group symbol | -P 1 |
Residual factor for all reflections | 0.1064 |
Residual factor for significantly intense reflections | 0.0655 |
Weighted residual factors for significantly intense reflections | 0.1719 |
Weighted residual factors for all reflections included in the refinement | 0.2266 |
Goodness-of-fit parameter for all reflections included in the refinement | 1.026 |
Diffraction radiation wavelength | 0.71073 Å |
Diffraction radiation type | MoKα |