Information card for entry 7700302
Formula | C37 H30 Cl3 P3 |
Calculated formula | C37 H30 Cl3 P3 |
Title of publication | Hexaphenyl carbodiphosphorane adducts of heavier group 15 element trichlorides: syntheses, properties and reactivities. |
Authors of publication | Münzer, Jörn E; Kneusels, Nis-Julian H; Weinert, Bastian; Neumüller, Bernhard; Kuzu, Istemi |
Journal of publication | Dalton transactions (Cambridge, England : 2003) |
Year of publication | 2019 |
Journal volume | 48 |
Journal issue | 29 |
Pages of publication | 11076 - 11085 |
a | 10.687 ± 0.001 Å |
b | 11.378 ± 0.001 Å |
c | 15.429 ± 0.001 Å |
α | 72.67 ± 0.01° |
β | 73.44 ± 0.01° |
γ | 65.28 ± 0.01° |
Cell volume | 1598.7 ± 0.3 Å3 |
Cell temperature | 100 ± 2 K |
Ambient diffraction temperature | 100 ± 2 K |
Number of distinct elements | 4 |
Space group number | 2 |
Hermann-Mauguin space group symbol | P -1 |
Hall space group symbol | -P 1 |
Residual factor for all reflections | 0.0307 |
Residual factor for significantly intense reflections | 0.0262 |
Weighted residual factors for significantly intense reflections | 0.0633 |
Weighted residual factors for all reflections included in the refinement | 0.0656 |
Goodness-of-fit parameter for all reflections included in the refinement | 1.063 |
Diffraction radiation wavelength | 0.71073 Å |
Diffraction radiation type | MoKα |