Information card for entry 7700304
Formula | C37 H30 Bi Cl3 P2 |
Calculated formula | C37 H30 Bi Cl3 P2 |
Title of publication | Hexaphenyl carbodiphosphorane adducts of heavier group 15 element trichlorides: syntheses, properties and reactivities. |
Authors of publication | Münzer, Jörn E; Kneusels, Nis-Julian H; Weinert, Bastian; Neumüller, Bernhard; Kuzu, Istemi |
Journal of publication | Dalton transactions (Cambridge, England : 2003) |
Year of publication | 2019 |
Journal volume | 48 |
Journal issue | 29 |
Pages of publication | 11076 - 11085 |
a | 12.931 ± 0.001 Å |
b | 15.347 ± 0.001 Å |
c | 16.821 ± 0.001 Å |
α | 90° |
β | 99.34 ± 0.01° |
γ | 90° |
Cell volume | 3293.9 ± 0.4 Å3 |
Cell temperature | 100 ± 2 K |
Ambient diffraction temperature | 100 ± 2 K |
Number of distinct elements | 5 |
Space group number | 14 |
Hermann-Mauguin space group symbol | P 1 21/c 1 |
Hall space group symbol | -P 2ybc |
Residual factor for all reflections | 0.0259 |
Residual factor for significantly intense reflections | 0.0209 |
Weighted residual factors for significantly intense reflections | 0.0435 |
Weighted residual factors for all reflections included in the refinement | 0.0448 |
Goodness-of-fit parameter for all reflections included in the refinement | 0.973 |
Diffraction radiation wavelength | 0.71073 Å |
Diffraction radiation type | MoKα |