Information card for entry 7700651
Formula | C68 H88 Co4 N18 O22 Tb2 |
Calculated formula | C68 H88 Co4 N18 O22 Tb2 |
Title of publication | A family of planar hexanuclear CoLn clusters with lucanidae-like arrangement and single-molecule magnet behavior. |
Authors of publication | Li, Qipeng; Peng, Yan; Qian, Jinjie; Yan, Tong; Du, Lin; Zhao, Qihua |
Journal of publication | Dalton transactions (Cambridge, England : 2003) |
Year of publication | 2019 |
Journal volume | 48 |
Journal issue | 34 |
Pages of publication | 12880 - 12887 |
a | 32.233 ± 0.005 Å |
b | 15.176 ± 0.002 Å |
c | 24.082 ± 0.004 Å |
α | 90° |
β | 124.194 ± 0.002° |
γ | 90° |
Cell volume | 9744 ± 3 Å3 |
Cell temperature | 173 ± 2 K |
Ambient diffraction temperature | 173 ± 2 K |
Number of distinct elements | 6 |
Space group number | 15 |
Hermann-Mauguin space group symbol | C 1 2/c 1 |
Hall space group symbol | -C 2yc |
Residual factor for all reflections | 0.0614 |
Residual factor for significantly intense reflections | 0.054 |
Weighted residual factors for significantly intense reflections | 0.1714 |
Weighted residual factors for all reflections included in the refinement | 0.1977 |
Goodness-of-fit parameter for all reflections included in the refinement | 1.074 |
Diffraction radiation wavelength | 0.71073 Å |
Diffraction radiation type | MoKα |