Information card for entry 7700657
Formula | C36 H37 B Cu N6 O2 P Se W |
Calculated formula | C36 H37 B Cu N6 O2 P Se W |
Title of publication | New binding modes for CSe: coinage metal coordination to a tungsten selenocarbonyl complex. |
Authors of publication | Frogley, Benjamin J.; Hill, Anthony F.; Watson, Lachlan J. |
Journal of publication | Dalton transactions (Cambridge, England : 2003) |
Year of publication | 2019 |
Journal volume | 48 |
Journal issue | 33 |
Pages of publication | 12598 - 12606 |
a | 9.5204 ± 0.0002 Å |
b | 20.3906 ± 0.0003 Å |
c | 10.6522 ± 0.0002 Å |
α | 90° |
β | 115.409 ± 0.002° |
γ | 90° |
Cell volume | 1867.85 ± 0.07 Å3 |
Cell temperature | 100 ± 0.1 K |
Ambient diffraction temperature | 100 ± 0.1 K |
Number of distinct elements | 9 |
Space group number | 4 |
Hermann-Mauguin space group symbol | P 1 21 1 |
Hall space group symbol | P 2yb |
Residual factor for all reflections | 0.0328 |
Residual factor for significantly intense reflections | 0.03 |
Weighted residual factors for significantly intense reflections | 0.072 |
Weighted residual factors for all reflections included in the refinement | 0.0731 |
Goodness-of-fit parameter for all reflections included in the refinement | 1.02 |
Diffraction radiation wavelength | 1.54184 Å |
Diffraction radiation type | CuKα |